Orange Forum • View topic - Build error

Build error

Report bugs (or imagined bugs).
(Archived/read-only, please use our ticketing system for reporting bugs and their discussion.)
Forum rules
Archived/read-only, please use our ticketing system for reporting bugs and their discussion.

Build error

Postby blazt » Sun Jun 13, 2010 12:12

For a few latest snapshot packages (including latest onne 2010-06-07) I couldn't bouild orange. Every time I get the same error:

g++ -fPIC -fpermissive -w -DLINUX -DORANGE_EXPORTS -O3 -march=native -mtune=native -O2 -pipe -c lib_components.cpp -o obj/lib_components.o
lib_components.cpp: In function 'int DomainContingency_getItemIndex(PyObject*, PyObject*)':
lib_components.cpp:1262:86: error: cannot pass objects of non-trivially-copyable type 'struct std::string' through '...'
make[1]: *** [obj/lib_components.o] Error 1
make[1]: Leaving directory `/var/abs/local/python-orange/src/source/orange'
make: *** [all] Error 1

I am using gcc-4.5.0 on Archlinux 64-bit and build instructions are located here:

PS: orange is also in Archlinux community unsupported repository if you want to include that info on your webpage:

Postby Ales » Mon Jun 14, 2010 14:56

Can you update from svn and try again.

Postby blazt » Mon Jun 14, 2010 23:34

Revision 8955 builds ok.

Postby blazt » Tue Jun 15, 2010 9:27

Daily snapshot 2010-06-15 builds now.

Problem reen :).

Postby kimerajamm » Sun Jun 20, 2010 11:58

Can you update

play poker online
online casino usa players

Return to Bugs