Orange Forum • View topic - Compile w/ gcc 3.4.3

Compile w/ gcc 3.4.3

Report bugs (or imagined bugs).
(Archived/read-only, please use our ticketing system for reporting bugs and their discussion.)
Forum rules
Archived/read-only, please use our ticketing system for reporting bugs and their discussion.

Compile w/ gcc 3.4.3

Postby Guest » Sat Apr 23, 2005 4:01

Hi,

In trying to compile the recent snap 4/23/2005, I've run in to the error shown below. The compilier is gcc 3.4.3. in a gentoo linux kernel. Here is the error shown:
Code: Select all
g++ -fPIC -fpermissive -w -DLINUX -O3 -DNO_NUMERIC -c orangene.cpp -o obj/orange
ne.o
gcc obj/heatmap.o obj/orangene.o -shared -lstdc++ -L../.. -lorange_include -lora
nge -o ../../orangene.so
/usr/lib/gcc/i686-pc-linux-gnu/3.4.3-20050110/../../../../i686-pc-linux-gnu/bin/ld: cannot find -lorange
collect2: ld returned 1 exit status
make[1]: *** [../../orangene.so] Error 1
make[1]: Leaving directory `/home/tmp/orange/source/orangene'
make[1]: Entering directory `/home/tmp/orange/source/corn'
g++    -c -o corn.o corn.cpp
gcc corn.o -shared -lstdc++ -L../.. -lorange_include -lorange -o ../../corn.so
/usr/lib/gcc/i686-pc-linux-gnu/3.4.3-20050110/../../../../i686-pc-linux-gnu/bin/ld: cannot find -lorange
collect2: ld returned 1 exit status
make[1]: *** [../../corn.so] Error 1
make[1]: Leaving directory `/home/tmp/orange/source/corn'
make[1]: Entering directory `/home/tmp/orange/source/statc'
g++    -c -o statc.o statc.cpp
gcc statc.o -shared -lstdc++ -L../.. -lorange_include -lorange -o ../../statc.so
/usr/lib/gcc/i686-pc-linux-gnu/3.4.3-20050110/../../../../i686-pc-linux-gnu/bin/ld: cannot find -lorange
collect2: ld returned 1 exit status
make[1]: *** [../../statc.so] Error 1
make[1]: Leaving directory `/home/tmp/orange/source/statc'
make: *** [all] Error 2
bash-2.05b#


Thank You
~

Postby Guest » Sun Apr 24, 2005 1:12

Hi.

I just wanted to mention that I have gsl-1.4 installed along with the other dependencies mentioned.

Thank you

Postby Guest » Sun Apr 24, 2005 10:11

Hello,
output of compiler that you are posting cannot help us locate any problems,
it tells only orange.so (and symbolic link liborange.so) does not exist.

Can you please look further up for the real problem why orange was not compiled and post it here.

Best way to 'catch' compiler output is:

make > compilation.log 2>&1

You can than search this file for errors.

Regards, Jure

Postby Guest » Tue Apr 26, 2005 7:40

Jure,
Thank you for responding. I see where there's an error with [ r_imports ], but was unable to solve it on my own. I'm still learning, so I appreciate the help and the patience.

Peter

Here is the entire log output.
Code: Select all
bash-2.05b# cd /home/tmp/orange/source
bash-2.05b# make
(for MODULE in include orange orangeom orangene corn statc ; \
   do make all -C $MODULE OLD=../..; done)
make[1]: Entering directory `/home/tmp/orange/source/include'
make[1]: Leaving directory `/home/tmp/orange/source/include'
make[1]: Entering directory `/home/tmp/orange/source/orange'
python ../pyxtract/jitlink_build.py R.so r_imports.hpp
g++ -fPIC -fpermissive -w -DLINUX -O3 -DNO_NUMERIC -c lib_learner.cpp -o obj/lib_learner.o
g++ -fPIC -fpermissive -w -DLINUX -O3 -DNO_NUMERIC -c linreg.cpp -o obj/linreg.o
g++ -fPIC -fpermissive -w -DLINUX -O3 -DNO_NUMERIC -c lwr.cpp -o obj/lwr.o
python ../pyxtract/jitlink_build.py R.so r_imports.hpp
g++ -fPIC -fpermissive -w -DLINUX -O3 -DNO_NUMERIC -c r_imports.cpp -o obj/r_imports.o
In file included from r_imports.cpp:1:
ppp/r_imports.jpp:11: error: missing terminating " character
ppp/r_imports.jpp:12: error: missing terminating " character
ppp/r_imports.jpp:13: error: missing terminating " character
ppp/r_imports.jpp:14: error: missing terminating " character
ppp/r_imports.jpp:16: error: expected `}' before ';' token
ppp/r_imports.jpp:16: error: expected `}' before ';' token
ppp/r_imports.jpp:16: error: brace-enclosed initializer used to initialize `char*'
make[1]: *** [obj/r_imports.o] Error 1
make[1]: Leaving directory `/home/tmp/orange/source/orange'
make[1]: Entering directory `/home/tmp/orange/source/orangeom'
gcc obj/optimizeAnchors.o obj/orangeom.o obj/triangulate.o -shared -lstdc++ -L../.. -lorange_include -lorange -o ../../orangeom.so
/usr/lib/gcc/i686-pc-linux-gnu/3.4.3-20050110/../../../../i686-pc-linux-gnu/bin/ld: cannot find -lorange
collect2: ld returned 1 exit status
make[1]: *** [../../orangeom.so] Error 1
make[1]: Leaving directory `/home/tmp/orange/source/orangeom'
make[1]: Entering directory `/home/tmp/orange/source/orangene'
gcc obj/heatmap.o obj/orangene.o -shared -lstdc++ -L../.. -lorange_include -lorange -o ../../orangene.so
/usr/lib/gcc/i686-pc-linux-gnu/3.4.3-20050110/../../../../i686-pc-linux-gnu/bin/ld: cannot find -lorange
collect2: ld returned 1 exit status
make[1]: *** [../../orangene.so] Error 1
make[1]: Leaving directory `/home/tmp/orange/source/orangene'
make[1]: Entering directory `/home/tmp/orange/source/corn'
gcc corn.o -shared -lstdc++ -L../.. -lorange_include -lorange -o ../../corn.so
/usr/lib/gcc/i686-pc-linux-gnu/3.4.3-20050110/../../../../i686-pc-linux-gnu/bin/ld: cannot find -lorange
collect2: ld returned 1 exit status
make[1]: *** [../../corn.so] Error 1
make[1]: Leaving directory `/home/tmp/orange/source/corn'
make[1]: Entering directory `/home/tmp/orange/source/statc'
gcc statc.o -shared -lstdc++ -L../.. -lorange_include -lorange -o ../../statc.so
/usr/lib/gcc/i686-pc-linux-gnu/3.4.3-20050110/../../../../i686-pc-linux-gnu/bin/ld: cannot find -lorange
collect2: ld returned 1 exit status
make[1]: *** [../../statc.so] Error 1
make[1]: Leaving directory `/home/tmp/orange/source/statc'
make: *** [all] Error 2
bash-2.05b#


Postby jurem » Wed Apr 27, 2005 9:57

Hi,
I've finally located this bug. It is not bug in Orange source code but in scripts, which are generating daily snapshot package.
Fix will take affect only after few days, so I'm suggesting you use CVS to get Orange sources. You can checkout sources from CVS this way:

<login into CVS server>
cvs -d :pserver:cvs@estelle.fri.uni-lj.si:/CVS login
<type in password, which is 'cvs'>

<check out sources>
cvs -d :pserver:cvs@estelle.fri.uni-lj.si:/CVS co orange
cvs -d :pserver:cvs@estelle.fri.uni-lj.si:/CVS co orange/source source

Thanks for reporting this bug,
regards, Jure

Postby Guest » Wed Apr 27, 2005 10:26

Jure ...et al,

Thank You very much!

Peter

Postby Guest » Fri Apr 29, 2005 6:43

Hi Jure,

I'm still having trouble.. It does not seem to accept the password 'cvs'.

Thank you
Code: Select all
bash-2.05b# cvs -d :pserver:cvs@estelle.fri.uni-lj.si:/CVS login
Logging in to :pserver:cvs@estelle.fri.uni-lj.si:2401/CVS
CVS password:
cvs [login aborted]: connect to estelle.fri.uni-lj.si(193.2.76.85):2401 failed: Connection refused
bash-2.05b#

Postby Guest » Fri Apr 29, 2005 7:14

continued: From Post Above

...So I tried the recent snapshot again to see if correction was in effect yet, and I was able to complete 'make' without error. But, when I tried 'make install' I got errors. I provided both log outputs for you to see. Thanks again for helping.

make
Code: Select all
bash-2.05b# make
(for MODULE in include orange orangeom orangene corn statc ; \
   do make all -C $MODULE OLD=../..; done)
make[1]: Entering directory `/home/tmp/orange/source/include'
Makefile:5: makefile.deps: No such file or directory
python ../pyxtract/makedep.py -n INCLUDE
rm -f ppp/stamp
rm -f px/stamp
make[1]: Leaving directory `/home/tmp/orange/source/include'
make[1]: Entering directory `/home/tmp/orange/source/include'
g++ -fPIC -fpermissive -w -DLINUX -O3 -DNO_NUMERIC -c c2py.cpp -o obj/c2py.o
g++ -fPIC -fpermissive -w -DLINUX -O3 -DNO_NUMERIC -c common.cpp -o obj/common.o
g++ -fPIC -fpermissive -w -DLINUX -O3 -DNO_NUMERIC -c crc32.cpp -o obj/crc32.o
g++ -fPIC -fpermissive -w -DLINUX -O3 -DNO_NUMERIC -c lcomb.cpp -o obj/lcomb.o
g++ -fPIC -fpermissive -w -DLINUX -O3 -DNO_NUMERIC -c stat.cpp -o obj/stat.o
g++ -fPIC -fpermissive -w -DLINUX -O3 -DNO_NUMERIC -c statexceptions.cpp -o obj/
statexceptions.o
g++ -fPIC -fpermissive -w -DLINUX -O3 -DNO_NUMERIC -c strings.cpp -o obj/strings
.o
ar -r ../../liborange_include.a obj/c2py.o obj/common.o obj/crc32.o obj/lcomb.o
obj/stat.o obj/statexceptions.o obj/strings.o
ar: creating ../../liborange_include.a
make[1]: Leaving directory `/home/tmp/orange/source/include'
make[1]: Entering directory `/home/tmp/orange/source/orange'
python ../pyxtract/pyprops.py -n ORANGE
transdomain.hpp(32): Warning: class 'TDomainTransformerConstructor' is not expor
ted to DLL
Creating ppp/examplegen.ppp
Creating ppp/random.ppp
Creating ppp/minimal_error.ppp
Creating ppp/filter.ppp
Creating ppp/exampleclustering.ppp
Creating ppp/stringvars.ppp
Creating ppp/examples.ppp
Creating ppp/clas_gen.ppp
Creating ppp/c4.5.ppp
Creating ppp/tabdelim.ppp
Creating ppp/orvector.ppp
Creating ppp/classfromvar.ppp
Creating ppp/costwrapper.ppp
Creating ppp/logistic.ppp
Creating ppp/cost.ppp
Creating ppp/basket.ppp
Creating ppp/pnn.ppp
Creating ppp/basstat.ppp
Creating ppp/distance.ppp
Creating ppp/distance_dtw.ppp
Creating ppp/distancemap.ppp
Creating ppp/hclust.ppp
Creating ppp/learn.ppp
Creating ppp/values.ppp
Creating ppp/logfit.ppp
Creating ppp/subsets.ppp
Creating ppp/filegen.ppp
Creating ppp/decomposition.ppp
Creating ppp/induce.ppp
Creating ppp/majority.ppp
Creating ppp/discretize.ppp
Creating ppp/transdomain.ppp
Creating ppp/minimal_complexity.ppp
Creating ppp/progress.ppp
Creating ppp/distvars.ppp
Creating ppp/assistant.ppp
Creating ppp/classify.ppp
Creating ppp/pythonvars.ppp
Creating ppp/trindex.ppp
Creating ppp/bayes.ppp
Creating ppp/tdidt_split.ppp
Creating ppp/measures.ppp
Creating ppp/spec_gen.ppp
Creating ppp/root.ppp
Creating ppp/tdidt.ppp
Creating ppp/imputation.ppp
Creating ppp/vars.ppp
Creating ppp/rulelearner.ppp
Creating ppp/cartesian.ppp
Creating ppp/calibrate.ppp
Creating ppp/nearest.ppp
Creating ppp/estimateprob.ppp
Creating ppp/dist_clustering.ppp
Creating ppp/assoc.ppp
Creating ppp/table.ppp
Creating ppp/tdidt_stop.ppp
Creating ppp/redundancy.ppp
Creating ppp/knn.ppp
Creating ppp/preprocessors.ppp
Creating ppp/spec_contingency.ppp
Creating ppp/transval.ppp
Creating ppp/lookup.ppp
Creating ppp/graph.ppp
Creating ppp/c45inter.ppp
Creating ppp/callback.ppp
Creating ppp/domain.ppp
Creating ppp/symmatrix.ppp
Creating ppp/contingency.ppp
Creating ppp/retisinter.ppp
Creating ppp/linreg.ppp
Creating ppp/relief.ppp
Creating ppp/survival.ppp
Creating ppp/lwr.ppp
Creating ppp/svm.ppp
python ../pyxtract/pyxtract.py -m -n ORANGE lib_vectors.cpp lib_io.cpp cls_orang
e.cpp cls_example.cpp cls_misc.cpp cls_value.cpp lib_learner.cpp lib_kernel.cpp
pythonvars.cpp distancemap.cpp orange.cpp lib_components.cpp callback.cpp lib_pr
eprocess.cpp
Parsing lib_vectors.cpp
Parsing lib_io.cpp
Parsing cls_orange.cpp
Parsing cls_example.cpp
Parsing cls_misc.cpp
Parsing cls_value.cpp
Parsing lib_learner.cpp
Parsing lib_kernel.cpp
Parsing pythonvars.cpp
Parsing distancemap.cpp
Parsing orange.cpp
Parsing lib_components.cpp
Parsing callback.cpp
Parsing lib_preprocess.cpp
Creating lib_vectors.px
Creating lib_io.px
Creating cls_orange.px
Creating cls_example.px
Creating cls_misc.px
Creating cls_value.px
Creating lib_learner.px
Creating lib_kernel.px
Creating pythonvars.px
Creating distancemap.px
Creating orange.px
Creating lib_components.px
Creating callback.px
Creating lib_preprocess.px
Creating externs.px
Creating initialization.px
g++ -fPIC -fpermissive -w -DLINUX -O3 -DNO_NUMERIC -c assistant.cpp -o obj/assis
tant.o
g++ -fPIC -fpermissive -w -DLINUX -O3 -DNO_NUMERIC -c assoc.cpp -o obj/assoc.o
g++ -fPIC -fpermissive -w -DLINUX -O3 -DNO_NUMERIC -c assoc_sparse.cpp -o obj/as
soc_sparse.o
g++ -fPIC -fpermissive -w -DLINUX -O3 -DNO_NUMERIC -c basket.cpp -o obj/basket.o
g++ -fPIC -fpermissive -w -DLINUX -O3 -DNO_NUMERIC -c basstat.cpp -o obj/basstat
.o
g++ -fPIC -fpermissive -w -DLINUX -O3 -DNO_NUMERIC -c bayes.cpp -o obj/bayes.o
g++ -fPIC -fpermissive -w -DLINUX -O3 -DNO_NUMERIC -c boolcnt.cpp -o obj/boolcnt
.o
g++ -fPIC -fpermissive -w -DLINUX -O3 -DNO_NUMERIC -c c4.5.cpp -o obj/c4.5.o
g++ -fPIC -fpermissive -w -DLINUX -O3 -DNO_NUMERIC -c c45inter.cpp -o obj/c45int
er.o
g++ -fPIC -fpermissive -w -DLINUX -O3 -DNO_NUMERIC -c calibrate.cpp -o obj/calib
rate.o
g++ -fPIC -fpermissive -w -DLINUX -O3 -DNO_NUMERIC -c callback.cpp -o obj/callba
ck.o
g++ -fPIC -fpermissive -w -DLINUX -O3 -DNO_NUMERIC -c cartesian.cpp -o obj/carte
sian.o
g++ -fPIC -fpermissive -w -DLINUX -O3 -DNO_NUMERIC -c clas_gen.cpp -o obj/clas_g
en.o
g++ -fPIC -fpermissive -w -DLINUX -O3 -DNO_NUMERIC -c classfromvar.cpp -o obj/cl
assfromvar.o
g++ -fPIC -fpermissive -w -DLINUX -O3 -DNO_NUMERIC -c classifier.cpp -o obj/clas
sifier.o
g++ -fPIC -fpermissive -w -DLINUX -O3 -DNO_NUMERIC -c cls_example.cpp -o obj/cls
_example.o
g++ -fPIC -fpermissive -w -DLINUX -O3 -DNO_NUMERIC -c cls_misc.cpp -o obj/cls_mi
sc.o
g++ -fPIC -fpermissive -w -DLINUX -O3 -DNO_NUMERIC -c cls_orange.cpp -o obj/cls_
orange.o
g++ -fPIC -fpermissive -w -DLINUX -O3 -DNO_NUMERIC -c cls_value.cpp -o obj/cls_v
alue.o
g++ -fPIC -fpermissive -w -DLINUX -O3 -DNO_NUMERIC -c contingency.cpp -o obj/con
tingency.o
g++ -fPIC -fpermissive -w -DLINUX -O3 -DNO_NUMERIC -c converts.cpp -o obj/conver
ts.o
g++ -fPIC -fpermissive -w -DLINUX -O3 -DNO_NUMERIC -c cost.cpp -o obj/cost.o
g++ -fPIC -fpermissive -w -DLINUX -O3 -DNO_NUMERIC -c costwrapper.cpp -o obj/cos
twrapper.o
g++ -fPIC -fpermissive -w -DLINUX -O3 -DNO_NUMERIC -c decomposition.cpp -o obj/d
ecomposition.o
g++ -fPIC -fpermissive -w -DLINUX -O3 -DNO_NUMERIC -c dictproxy.cpp -o obj/dictp
roxy.o
g++ -fPIC -fpermissive -w -DLINUX -O3 -DNO_NUMERIC -c discretize.cpp -o obj/disc
retize.o
g++ -fPIC -fpermissive -w -DLINUX -O3 -DNO_NUMERIC -c dist_clustering.cpp -o obj
/dist_clustering.o
g++ -fPIC -fpermissive -w -DLINUX -O3 -DNO_NUMERIC -c distance.cpp -o obj/distan
ce.o
g++ -fPIC -fpermissive -w -DLINUX -O3 -DNO_NUMERIC -c distance_dtw.cpp -o obj/di
stance_dtw.o
g++ -fPIC -fpermissive -w -DLINUX -O3 -DNO_NUMERIC -c distancemap.cpp -o obj/dis
tancemap.o
g++ -fPIC -fpermissive -w -DLINUX -O3 -DNO_NUMERIC -c distvars.cpp -o obj/distva
rs.o
g++ -fPIC -fpermissive -w -DLINUX -O3 -DNO_NUMERIC -c domain.cpp -o obj/domain.o
g++ -fPIC -fpermissive -w -DLINUX -O3 -DNO_NUMERIC -c domaindepot.cpp -o obj/dom
aindepot.o
g++ -fPIC -fpermissive -w -DLINUX -O3 -DNO_NUMERIC -c errors.cpp -o obj/errors.o
g++ -fPIC -fpermissive -w -DLINUX -O3 -DNO_NUMERIC -c estimateprob.cpp -o obj/es
timateprob.o
g++ -fPIC -fpermissive -w -DLINUX -O3 -DNO_NUMERIC -c exampleclustering.cpp -o o
bj/exampleclustering.o
g++ -fPIC -fpermissive -w -DLINUX -O3 -DNO_NUMERIC -c examplegen.cpp -o obj/exam
plegen.o
g++ -fPIC -fpermissive -w -DLINUX -O3 -DNO_NUMERIC -c examples.cpp -o obj/exampl
es.o
g++ -fPIC -fpermissive -w -DLINUX -O3 -DNO_NUMERIC -c excel.cpp -o obj/excel.o
g++ -fPIC -fpermissive -w -DLINUX -O3 -DNO_NUMERIC -c filegen.cpp -o obj/filegen
.o
g++ -fPIC -fpermissive -w -DLINUX -O3 -DNO_NUMERIC -c filter.cpp -o obj/filter.o
g++ -fPIC -fpermissive -w -DLINUX -O3 -DNO_NUMERIC -c functions.cpp -o obj/funct
ions.o
g++ -fPIC -fpermissive -w -DLINUX -O3 -DNO_NUMERIC -c garbage.cpp -o obj/garbage
.o
g++ -fPIC -fpermissive -w -DLINUX -O3 -DNO_NUMERIC -c getarg.cpp -o obj/getarg.o
g++ -fPIC -fpermissive -w -DLINUX -O3 -DNO_NUMERIC -c graph.cpp -o obj/graph.o
g++ -fPIC -fpermissive -w -DLINUX -O3 -DNO_NUMERIC -c gslconversions.cpp -o obj/
gslconversions.o
g++ -fPIC -fpermissive -w -DLINUX -O3 -DNO_NUMERIC -c hclust.cpp -o obj/hclust.o
g++ -fPIC -fpermissive -w -DLINUX -O3 -DNO_NUMERIC -c imputation.cpp -o obj/impu
tation.o
g++ -fPIC -fpermissive -w -DLINUX -O3 -DNO_NUMERIC -c induce.cpp -o obj/induce.o
g++ -fPIC -fpermissive -w -DLINUX -O3 -DNO_NUMERIC -c jit_linker.cpp -o obj/jit_
linker.o
g++ -fPIC -fpermissive -w -DLINUX -O3 -DNO_NUMERIC -c knn.cpp -o obj/knn.o
g++ -fPIC -fpermissive -w -DLINUX -O3 -DNO_NUMERIC -c learn.cpp -o obj/learn.o
g++ -fPIC -fpermissive -w -DLINUX -O3 -DNO_NUMERIC -c lib_components.cpp -o obj/
lib_components.o
g++ -fPIC -fpermissive -w -DLINUX -O3 -DNO_NUMERIC -c lib_io.cpp -o obj/lib_io.o
g++ -fPIC -fpermissive -w -DLINUX -O3 -DNO_NUMERIC -c lib_kernel.cpp -o obj/lib_
kernel.o
python ../pyxtract/jitlink_build.py R.so r_imports.hpp
g++ -fPIC -fpermissive -w -DLINUX -O3 -DNO_NUMERIC -c lib_learner.cpp -o obj/lib
_learner.o
g++ -fPIC -fpermissive -w -DLINUX -O3 -DNO_NUMERIC -c lib_preprocess.cpp -o obj/
lib_preprocess.o
g++ -fPIC -fpermissive -w -DLINUX -O3 -DNO_NUMERIC -c lib_vectors.cpp -o obj/lib
_vectors.o
g++ -fPIC -fpermissive -w -DLINUX -O3 -DNO_NUMERIC -c linreg.cpp -o obj/linreg.o
g++ -fPIC -fpermissive -w -DLINUX -O3 -DNO_NUMERIC -c logfit.cpp -o obj/logfit.o
g++ -fPIC -fpermissive -w -DLINUX -O3 -DNO_NUMERIC -c logistic.cpp -o obj/logist
ic.o
g++ -fPIC -fpermissive -w -DLINUX -O3 -DNO_NUMERIC -c logreg.cpp -o obj/logreg.o
g++ -fPIC -fpermissive -w -DLINUX -O3 -DNO_NUMERIC -c lookup.cpp -o obj/lookup.o
g++ -fPIC -fpermissive -w -DLINUX -O3 -DNO_NUMERIC -c lsq.cpp -o obj/lsq.o
g++ -fPIC -fpermissive -w -DLINUX -O3 -DNO_NUMERIC -c lwr.cpp -o obj/lwr.o
g++ -fPIC -fpermissive -w -DLINUX -O3 -DNO_NUMERIC -c majority.cpp -o obj/majori
ty.o
g++ -fPIC -fpermissive -w -DLINUX -O3 -DNO_NUMERIC -c measures.cpp -o obj/measur
es.o
g++ -fPIC -fpermissive -w -DLINUX -O3 -DNO_NUMERIC -c meta.cpp -o obj/meta.o
g++ -fPIC -fpermissive -w -DLINUX -O3 -DNO_NUMERIC -c minimal_complexity.cpp -o
obj/minimal_complexity.o
g++ -fPIC -fpermissive -w -DLINUX -O3 -DNO_NUMERIC -c minimal_error.cpp -o obj/m
inimal_error.o
g++ -fPIC -fpermissive -w -DLINUX -O3 -DNO_NUMERIC -c nearest.cpp -o obj/nearest
.o
g++ -fPIC -fpermissive -w -DLINUX -O3 -DNO_NUMERIC -c numeric_interface.cpp -o o
bj/numeric_interface.o
g++ -fPIC -fpermissive -w -DLINUX -O3 -DNO_NUMERIC -c orange.cpp -o obj/orange.o
g++ -fPIC -fpermissive -w -DLINUX -O3 -DNO_NUMERIC -c orvector.cpp -o obj/orvect
or.o
g++ -fPIC -fpermissive -w -DLINUX -O3 -DNO_NUMERIC -c pnn.cpp -o obj/pnn.o
g++ -fPIC -fpermissive -w -DLINUX -O3 -DNO_NUMERIC -c preprocessors.cpp -o obj/p
reprocessors.o
g++ -fPIC -fpermissive -w -DLINUX -O3 -DNO_NUMERIC -c progress.cpp -o obj/progre
ss.o
g++ -fPIC -fpermissive -w -DLINUX -O3 -DNO_NUMERIC -c pythonvars.cpp -o obj/pyth
onvars.o
python ../pyxtract/jitlink_build.py R.so r_imports.hpp
g++ -fPIC -fpermissive -w -DLINUX -O3 -DNO_NUMERIC -c r_imports.cpp -o obj/r_imp
orts.o
g++ -fPIC -fpermissive -w -DLINUX -O3 -DNO_NUMERIC -c random.cpp -o obj/random.o
g++ -fPIC -fpermissive -w -DLINUX -O3 -DNO_NUMERIC -c rconversions.cpp -o obj/rc
onversions.o
g++ -fPIC -fpermissive -w -DLINUX -O3 -DNO_NUMERIC -c readdata.cpp -o obj/readda
ta.o
g++ -fPIC -fpermissive -w -DLINUX -O3 -DNO_NUMERIC -c redundancy.cpp -o obj/redu
ndancy.o
g++ -fPIC -fpermissive -w -DLINUX -O3 -DNO_NUMERIC -c retisinter.cpp -o obj/reti
sinter.o
g++ -fPIC -fpermissive -w -DLINUX -O3 -DNO_NUMERIC -c root.cpp -o obj/root.o
g++ -fPIC -fpermissive -w -DLINUX -O3 -DNO_NUMERIC -c rule_conditions.cpp -o obj
/rule_conditions.o
g++ -fPIC -fpermissive -w -DLINUX -O3 -DNO_NUMERIC -c rulelearner.cpp -o obj/rul
elearner.o
g++ -fPIC -fpermissive -w -DLINUX -O3 -DNO_NUMERIC -c spec_contingency.cpp -o ob
j/spec_contingency.o
g++ -fPIC -fpermissive -w -DLINUX -O3 -DNO_NUMERIC -c spec_gen.cpp -o obj/spec_g
en.o
g++ -fPIC -fpermissive -w -DLINUX -O3 -DNO_NUMERIC -c stringvars.cpp -o obj/stri
ngvars.o
g++ -fPIC -fpermissive -w -DLINUX -O3 -DNO_NUMERIC -c subsets.cpp -o obj/subsets
.o
g++ -fPIC -fpermissive -w -DLINUX -O3 -DNO_NUMERIC -c survival.cpp -o obj/surviv
al.o
g++ -fPIC -fpermissive -w -DLINUX -O3 -DNO_NUMERIC -c svm.cpp -o obj/svm.o
g++ -fPIC -fpermissive -w -DLINUX -O3 -DNO_NUMERIC -c symmatrix.cpp -o obj/symma
trix.o
g++ -fPIC -fpermissive -w -DLINUX -O3 -DNO_NUMERIC -c tabdelim.cpp -o obj/tabdel
im.o
g++ -fPIC -fpermissive -w -DLINUX -O3 -DNO_NUMERIC -c table.cpp -o obj/table.o
g++ -fPIC -fpermissive -w -DLINUX -O3 -DNO_NUMERIC -c tdidt.cpp -o obj/tdidt.o
g++ -fPIC -fpermissive -w -DLINUX -O3 -DNO_NUMERIC -c tdidt_split.cpp -o obj/tdi
dt_split.o
g++ -fPIC -fpermissive -w -DLINUX -O3 -DNO_NUMERIC -c tdidt_stop.cpp -o obj/tdid
t_stop.o
g++ -fPIC -fpermissive -w -DLINUX -O3 -DNO_NUMERIC -c transdomain.cpp -o obj/tra
nsdomain.o
g++ -fPIC -fpermissive -w -DLINUX -O3 -DNO_NUMERIC -c transval.cpp -o obj/transv
al.o
g++ -fPIC -fpermissive -w -DLINUX -O3 -DNO_NUMERIC -c trindex.cpp -o obj/trindex
.o
g++ -fPIC -fpermissive -w -DLINUX -O3 -DNO_NUMERIC -c valuelisttemplate.cpp -o o
bj/valuelisttemplate.o
g++ -fPIC -fpermissive -w -DLINUX -O3 -DNO_NUMERIC -c values.cpp -o obj/values.o
g++ -fPIC -fpermissive -w -DLINUX -O3 -DNO_NUMERIC -c vars.cpp -o obj/vars.o
gcc obj/assistant.o obj/assoc.o obj/assoc_sparse.o obj/basket.o obj/basstat.o ob
j/bayes.o obj/boolcnt.o obj/c4.5.o obj/c45inter.o obj/calibrate.o obj/callback.o
 obj/cartesian.o obj/clas_gen.o obj/classfromvar.o obj/classifier.o obj/cls_exam
ple.o obj/cls_misc.o obj/cls_orange.o obj/cls_value.o obj/contingency.o obj/conv
erts.o obj/cost.o obj/costwrapper.o obj/decomposition.o obj/dictproxy.o obj/disc
retize.o obj/dist_clustering.o obj/distance.o obj/distance_dtw.o obj/distancemap
.o obj/distvars.o obj/domain.o obj/domaindepot.o obj/errors.o obj/estimateprob.o
 obj/exampleclustering.o obj/examplegen.o obj/examples.o obj/excel.o obj/filegen
.o obj/filter.o obj/functions.o obj/garbage.o obj/getarg.o obj/graph.o obj/gslco
nversions.o obj/hclust.o obj/imputation.o obj/induce.o obj/jit_linker.o obj/knn.
o obj/learn.o obj/lib_components.o obj/lib_io.o obj/lib_kernel.o obj/lib_learner
.o obj/lib_preprocess.o obj/lib_vectors.o obj/linreg.o obj/logfit.o obj/logistic
.o obj/logreg.o obj/lookup.o obj/lsq.o obj/lwr.o obj/majority.o obj/measures.o o
bj/meta.o obj/minimal_complexity.o obj/minimal_error.o obj/nearest.o obj/numeric
_interface.o obj/orange.o obj/orvector.o obj/pnn.o obj/preprocessors.o obj/progr
ess.o obj/pythonvars.o obj/r_imports.o obj/random.o obj/rconversions.o obj/readd
ata.o obj/redundancy.o obj/retisinter.o obj/root.o obj/rule_conditions.o obj/rul
elearner.o obj/spec_contingency.o obj/spec_gen.o obj/stringvars.o obj/subsets.o
obj/survival.o obj/svm.o obj/symmatrix.o obj/tabdelim.o obj/table.o obj/tdidt.o
obj/tdidt_split.o obj/tdidt_stop.o obj/transdomain.o obj/transval.o obj/trindex.
o obj/valuelisttemplate.o obj/values.o obj/vars.o -shared -lstdc++ -L../.. -lora
nge_include -o ../../orange.so -lgsl -lgslcblas
cd ../..; pwd; ln -sf orange.so liborange.so
/home/tmp/orange
make[1]: Leaving directory `/home/tmp/orange/source/orange'
make[1]: Entering directory `/home/tmp/orange/source/orangeom'
Makefile:5: makefile.deps: No such file or directory
python ../pyxtract/makedep.py -n ORANGEOM
rm -f ppp/stamp
rm -f px/stamp
make[1]: Leaving directory `/home/tmp/orange/source/orangeom'
make[1]: Entering directory `/home/tmp/orange/source/orangeom'
python ../pyxtract/pyxtract.py -m -n ORANGEOM triangulate.cpp optimizeAnchors.cp
p orangeom.cpp -l ../orange/px/stamp
Parsing triangulate.cpp
Parsing optimizeAnchors.cpp
Parsing orangeom.cpp
Creating triangulate.px
Creating optimizeAnchors.px
Creating orangeom.px
Creating externs.px
Creating initialization.px
g++ -fPIC -fpermissive -w -DLINUX -O3 -DNO_NUMERIC -c optimizeAnchors.cpp -o obj
/optimizeAnchors.o
g++ -fPIC -fpermissive -w -DLINUX -O3 -DNO_NUMERIC -c orangeom.cpp -o obj/orange
om.o
g++ -fPIC -fpermissive -w -DLINUX -O3 -DNO_NUMERIC -c triangulate.cpp -o obj/tri
angulate.o
gcc obj/optimizeAnchors.o obj/orangeom.o obj/triangulate.o -shared -lstdc++ -L..
/.. -lorange_include -lorange -o ../../orangeom.so
make[1]: Leaving directory `/home/tmp/orange/source/orangeom'
make[1]: Entering directory `/home/tmp/orange/source/orangene'
Makefile:5: makefile.deps: No such file or directory
python ../pyxtract/makedep.py -n ORANGENE
rm -f ppp/stamp
rm -f px/stamp
make[1]: Leaving directory `/home/tmp/orange/source/orangene'
make[1]: Entering directory `/home/tmp/orange/source/orangene'
python ../pyxtract/pyprops.py -n ORANGENE -l ../orange/ppp/stamp
Warning: type TIntList, required by THeatmap.exampleIndices not registered
Creating ppp/heatmap.ppp
python ../pyxtract/pyxtract.py -m -n ORANGENE orangene.cpp heatmap.cpp -l ../orange/px/stamp
Parsing orangene.cpp
Parsing heatmap.cpp
Creating orangene.px
Creating heatmap.px
Creating externs.px
Creating initialization.px
g++ -fPIC -fpermissive -w -DLINUX -O3 -DNO_NUMERIC -c heatmap.cpp -o obj/heatmap.o
g++ -fPIC -fpermissive -w -DLINUX -O3 -DNO_NUMERIC -c orangene.cpp -o obj/orangene.o
gcc obj/heatmap.o obj/orangene.o -shared -lstdc++ -L../.. -lorange_include -lorange -o ../../orangene.so
make[1]: Leaving directory `/home/tmp/orange/source/orangene'
make[1]: Entering directory `/home/tmp/orange/source/corn'
g++    -c -o corn.o corn.cpp
gcc corn.o -shared -lstdc++ -L../.. -lorange_include -lorange -o ../../corn.so
make[1]: Leaving directory `/home/tmp/orange/source/corn'
make[1]: Entering directory `/home/tmp/orange/source/statc'
g++    -c -o statc.o statc.cpp
gcc statc.o -shared -lstdc++ -L../.. -lorange_include -lorange -o ../../statc.so
make[1]: Leaving directory `/home/tmp/orange/source/statc'



make install
Code: Select all
(for MODULE in include orange orangeom orangene corn statc ; \
   do make all -C $MODULE OLD=../..; done)
make[1]: Entering directory `/home/tmp/orange/source/include'
make[1]: Leaving directory `/home/tmp/orange/source/include'
make[1]: Entering directory `/home/tmp/orange/source/orange'
python ../pyxtract/jitlink_build.py R.so r_imports.hpp
g++ -fPIC -fpermissive -w -DLINUX -O3 -DNO_NUMERIC -c lib_learner.cpp -o obj/lib_learner.o
g++ -fPIC -fpermissive -w -DLINUX -O3 -DNO_NUMERIC -c linreg.cpp -o obj/linreg.o
g++ -fPIC -fpermissive -w -DLINUX -O3 -DNO_NUMERIC -c lwr.cpp -o obj/lwr.o
python ../pyxtract/jitlink_build.py R.so r_imports.hpp
g++ -fPIC -fpermissive -w -DLINUX -O3 -DNO_NUMERIC -c r_imports.cpp -o obj/r_imports.o
gcc obj/assistant.o obj/assoc.o obj/assoc_sparse.o obj/basket.o obj/basstat.o obj/bayes.o obj/boolcnt.o obj/c4.5.o obj/c45inter.o obj/calibrate.o obj/callback.o obj/cartesian.o obj/clas_gen.o obj/classfromvar.o obj/classifier.o obj/cls_example.o obj/cls_misc.o obj/cls_orange.o obj/cls_value.o obj/contingency.o obj/converts.o obj/cost.o obj/costwrapper.o obj/decomposition.o obj/dictproxy.o obj/discretize.o obj/dist_clustering.o obj/distance.o obj/distance_dtw.o obj/distancemap.o obj/distvars.o obj/domain.o obj/domaindepot.o obj/errors.o obj/estimateprob.o obj/exampleclustering.o obj/examplegen.o obj/examples.o obj/excel.o obj/filegen.o obj/filter.o obj/functions.o obj/garbage.o obj/getarg.o obj/graph.o obj/gslconversions.o obj/hclust.o obj/imputation.o obj/induce.o obj/jit_linker.o obj/knn.o obj/learn.o obj/lib_components.o obj/lib_io.o obj/lib_kernel.o obj/lib_learner.o obj/lib_preprocess.o obj/lib_vectors.o obj/linreg.o obj/logfit.o obj/logistic.o obj/logreg.o obj/lookup.o obj/lsq.o obj/lwr.o obj/majority.o obj/measures.o obj/meta.o obj/minimal_complexity.o obj/minimal_error.o obj/nearest.o obj/numeric_interface.oobj/orange.o obj/orvector.o obj/pnn.o obj/preprocessors.o obj/progress.o obj/pythonvars.o obj/r_imports.o obj/random.o obj/rconversions.o obj/readdata.o obj/redundancy.o obj/retisinter.o obj/root.o obj/rule_conditions.o obj/rulelearner.o obj/spec_contingency.o obj/spec_gen.o obj/stringvars.o obj/subsets.o obj/survival.o obj/svm.o obj/symmatrix.o obj/tabdelim.o obj/table.o obj/tdidt.o obj/tdidt_split.o obj/tdidt_stop.o obj/transdomain.o obj/transval.o obj/trindex.o obj/valuelisttemplate.o obj/values.o obj/vars.o -shared -lstdc++ -L../.. -lorange_include -o ../../orange.so -lgsl -lgslcblas
cd ../..; pwd; ln -sf orange.so liborange.so
/home/tmp/orange
make[1]: Leaving directory `/home/tmp/orange/source/orange'
make[1]: Entering directory `/home/tmp/orange/source/orangeom'
make[1]: Leaving directory `/home/tmp/orange/source/orangeom'
make[1]: Entering directory `/home/tmp/orange/source/orangene'
make[1]: Leaving directory `/home/tmp/orange/source/orangene'
make[1]: Entering directory `/home/tmp/orange/source/corn'
make[1]: Leaving directory `/home/tmp/orange/source/corn'
make[1]: Entering directory `/home/tmp/orange/source/statc'
make[1]: Leaving directory `/home/tmp/orange/source/statc'
python -c "import compileall; compileall.compile_dir('..')"
Listing .. ...
Compiling ../DESolver.py ...
Listing ../OrangeCanvas ...
Listing ../OrangeCanvas/icons ...
Compiling ../OrangeCanvas/orngCanvasItems.py ...
Compiling ../OrangeCanvas/orngDlgs.py ...
Compiling ../OrangeCanvas/orngDoc.py ...
Compiling ../OrangeCanvas/orngOutput.py ...
Compiling ../OrangeCanvas/orngResources.py ...
Compiling ../OrangeCanvas/orngSignalManager.py ...
Compiling ../OrangeCanvas/orngTabs.py ...
Compiling ../OrangeCanvas/orngView.py ...
Compiling ../OrangeCanvas/xmlParse.py ...
Listing ../OrangeWidgets ...
Listing ../OrangeWidgets/Associate ...
Compiling ../OrangeWidgets/Associate/OWAssociationRules.py ...
Compiling ../OrangeWidgets/Associate/OWAssociationRulesFilter.py ...
Compiling ../OrangeWidgets/Associate/OWAssociationRulesPrint.py ...
Compiling ../OrangeWidgets/Associate/OWAssociationRulesViewer.py ...
Compiling ../OrangeWidgets/Associate/OWAttributeDistance.py ...
Compiling ../OrangeWidgets/Associate/OWDistanceMap.py ...
Compiling ../OrangeWidgets/Associate/OWExampleDistance.py ...
Compiling ../OrangeWidgets/Associate/OWInteractionGraph.py ...
Compiling ../OrangeWidgets/Associate/OWKMeans.py ...
Listing ../OrangeWidgets/Classify ...
Compiling ../OrangeWidgets/Classify/OWBasicSVM.py ...
Compiling ../OrangeWidgets/Classify/OWC45Tree.py ...
Compiling ../OrangeWidgets/Classify/OWClassificationTree.py ...
Compiling ../OrangeWidgets/Classify/OWClassificationTreeViewer.py ...
Compiling ../OrangeWidgets/Classify/OWClassificationTreeViewer2D.py ...
Compiling ../OrangeWidgets/Classify/OWClassificationTreeViewer2DOptions.py ...
Compiling ../OrangeWidgets/Classify/OWKNN.py ...
Compiling ../OrangeWidgets/Classify/OWLogisticRegression.py ...
Compiling ../OrangeWidgets/Classify/OWMajority.py ...
Compiling ../OrangeWidgets/Classify/OWNaiveBayes.py ...
Compiling ../OrangeWidgets/Classify/OWNaiveBayesSave.py ...
Compiling ../OrangeWidgets/Classify/OWNomogram.py ...
Compiling ../OrangeWidgets/Classify/OWNomogramGraph.py ...
Compiling ../OrangeWidgets/ColorPalette.py ...
Listing ../OrangeWidgets/Data ...
Compiling ../OrangeWidgets/Data/OWCategorize.py ...
Compiling ../OrangeWidgets/Data/OWDataDomain.py ...
Compiling ../OrangeWidgets/Data/OWDataTable.py ...
Compiling ../OrangeWidgets/Data/OWFile.py ...
Compiling ../OrangeWidgets/Data/OWOutcome.py ...
Compiling ../OrangeWidgets/Data/OWRank.py ...
Compiling ../OrangeWidgets/Data/OWSave.py ...
Compiling ../OrangeWidgets/Data/OWSelectData.py ...
Listing ../OrangeWidgets/Evaluate ...
Compiling ../OrangeWidgets/Evaluate/OWCalibrationPlot.py ...
Compiling ../OrangeWidgets/Evaluate/OWClassifiedDataTable.py ...
Compiling ../OrangeWidgets/Evaluate/OWLiftCurve.py ...
Compiling ../OrangeWidgets/Evaluate/OWROC.py ...
Compiling ../OrangeWidgets/Evaluate/OWTestLearners.py ...
Compiling ../OrangeWidgets/OWAbout.py ...
Compiling ../OrangeWidgets/OWBaseWidget.py ...
Compiling ../OrangeWidgets/OWClusterOptimization.py ...
Compiling ../OrangeWidgets/OWDlgs.py ...
Compiling ../OrangeWidgets/OWEnsemble.py ...
Compiling ../OrangeWidgets/OWGUI.py ...
Compiling ../OrangeWidgets/OWGraph.py ...
Compiling ../OrangeWidgets/OWGraphTools.py ...
Compiling ../OrangeWidgets/OWIRankOptions.py ...
Compiling ../OrangeWidgets/OWOptions.py ...
Compiling ../OrangeWidgets/OWToolbars.py ...
Compiling ../OrangeWidgets/OWTools.py ...
Compiling ../OrangeWidgets/OWVisAttrSelection.py ...
Compiling ../OrangeWidgets/OWVisFuncts.py ...
Compiling ../OrangeWidgets/OWVisGraph.py ...
Compiling ../OrangeWidgets/OWVisTools.py ...
Compiling ../OrangeWidgets/OWWidget.py ...
Compiling ../OrangeWidgets/OWkNNOptimization.py ...
Listing ../OrangeWidgets/Other ...
Compiling ../OrangeWidgets/Other/OWContinuize.py ...
Compiling ../OrangeWidgets/Other/OWInfo.py ...
Listing ../OrangeWidgets/Visualize ...
Compiling ../OrangeWidgets/Visualize/OWAttributeStatistics.py ...
Compiling ../OrangeWidgets/Visualize/OWDistributions.py ...
Compiling ../OrangeWidgets/Visualize/OWDistributionsMatrix.py ...
Compiling ../OrangeWidgets/Visualize/OWMosaicDisplay.py ...
Compiling ../OrangeWidgets/Visualize/OWParallelCoordinates.py ...
Compiling ../OrangeWidgets/Visualize/OWParallelGraph.py ...
Compiling ../OrangeWidgets/Visualize/OWPolyviz.py ...
Compiling ../OrangeWidgets/Visualize/OWPolyvizGraph.py ...
Compiling ../OrangeWidgets/Visualize/OWRadviz.py ...
Compiling ../OrangeWidgets/Visualize/OWRadvizGraph.py ...
Compiling ../OrangeWidgets/Visualize/OWScatterPlot.py ...
Compiling ../OrangeWidgets/Visualize/OWScatterPlotGraph.py ...
Compiling ../OrangeWidgets/Visualize/OWScatterPlotMatrix.py ...
Compiling ../OrangeWidgets/Visualize/OWSieveDiagram.py ...
Compiling ../OrangeWidgets/Visualize/OWSieveMultigram.py ...
Compiling ../OrangeWidgets/Visualize/OWSieveMultigramGraph.py ...
Compiling ../OrangeWidgets/Visualize/OWSurveyPlot.py ...
Compiling ../OrangeWidgets/Visualize/OWSurveyPlotGraph.py ...
Listing ../OrangeWidgets/icons ...
Compiling ../OrangeWidgets/orngTreeLearner.py ...
Compiling ../buildC45.py ...
Listing ../doc ...
Listing ../doc/datasets ...
Compiling ../doc/datasets/DATA_INFO.py ...
Listing ../doc/modules ...
Compiling ../doc/modules/assoc.py ...
Compiling ../doc/modules/ensemble.py ...
Compiling ../doc/modules/fss1.py ...
Compiling ../doc/modules/fss2.py ...
Compiling ../doc/modules/fss3.py ...
Compiling ../doc/modules/fss4.py ...
Compiling ../doc/modules/fss5.py ...
Compiling ../doc/modules/fss6.py ...
Compiling ../doc/modules/fss7.py ...
Compiling ../doc/modules/test.py ...
Compiling ../doc/modules/tree1.py ...
Compiling ../doc/modules/tree2.py ...
Compiling ../doc/modules/tree3.py ...
Compiling ../doc/modules/tree4.py ...
Compiling ../doc/modules/tree5.py ...
Compiling ../doc/modules/tree6.py ...
Compiling ../doc/modules/tree7.py ...
Compiling ../doc/modules/tree8.py ...
Compiling ../doc/modules/tree9.py ...
Listing ../doc/ofb ...
Compiling ../doc/ofb/accuracy.py ...
Compiling ../doc/ofb/accuracy2.py ...
Compiling ../doc/ofb/accuracy3.py ...
Compiling ../doc/ofb/accuracy4.py ...
Compiling ../doc/ofb/accuracy5.py ...
Compiling ../doc/ofb/accuracy6.py ...
Compiling ../doc/ofb/accuracy7.py ...
Compiling ../doc/ofb/assoc1.py ...
Compiling ../doc/ofb/assoc2.py ...
Compiling ../doc/ofb/assoc3.py ...
Compiling ../doc/ofb/bagging.py ...
Compiling ../doc/ofb/bagging_test.py ...
Compiling ../doc/ofb/bayes.py ...
Compiling ../doc/ofb/bayes_test.py ...
Compiling ../doc/ofb/classifier.py ...
Compiling ../doc/ofb/classifier2.py ...
Compiling ../doc/ofb/data_characteristics.py ...
Compiling ../doc/ofb/data_characteristics2.py ...
Compiling ../doc/ofb/data_characteristics3.py ...
Compiling ../doc/ofb/data_characteristics4.py ...
Compiling ../doc/ofb/disc.py ...
Compiling ../doc/ofb/disc1.py ...
Compiling ../doc/ofb/disc2.py ...
Compiling ../doc/ofb/disc3.py ...
Compiling ../doc/ofb/disc4.py ...
Compiling ../doc/ofb/disc5.py ...
Compiling ../doc/ofb/disc6.py ...
Compiling ../doc/ofb/domain1.py ...
Compiling ../doc/ofb/domain10.py ...
Compiling ../doc/ofb/domain11.py ...
Compiling ../doc/ofb/domain12.py ...
Compiling ../doc/ofb/domain13.py ...
Compiling ../doc/ofb/domain2.py ...
Compiling ../doc/ofb/domain3.py ...
Compiling ../doc/ofb/domain4.py ...
Compiling ../doc/ofb/domain5.py ...
Compiling ../doc/ofb/domain6.py ...
Compiling ../doc/ofb/domain7.py ...
Compiling ../doc/ofb/domain8.py ...
Compiling ../doc/ofb/domain9.py ...
Compiling ../doc/ofb/ensemble2.py ...
Compiling ../doc/ofb/ensemble3.py ...
Listing ../doc/ofb/formulas ...
Compiling ../doc/ofb/handful.py ...
Compiling ../doc/ofb/lenses.py ...
Compiling ../doc/ofb/nbdisc.py ...
Compiling ../doc/ofb/nbdisc_test.py ...
Compiling ../doc/ofb/regression1.py ...
Compiling ../doc/ofb/regression2.py ...
Compiling ../doc/ofb/regression3.py ...
Compiling ../doc/ofb/report_missing.py ...
Compiling ../doc/ofb/roc.py ...
Compiling ../doc/ofb/sample_adult.py ...
Compiling ../doc/ofb/tree.py ...
Compiling ../doc/ofb/tree_print.py ...
Listing ../doc/reference ...
Compiling ../doc/reference/ClassifierByExampleTable.py ...
Compiling ../doc/reference/ClassifierByLookupTable.py ...
Compiling ../doc/reference/CostMatrix.py ...
Compiling ../doc/reference/MeasureAttribute1.py ...
Compiling ../doc/reference/MeasureAttribute1a.py ...
Compiling ../doc/reference/MeasureAttribute1b.py ...
Compiling ../doc/reference/MeasureAttribute2.py ...
Compiling ../doc/reference/MeasureAttribute3.py ...
Compiling ../doc/reference/RandomClassifier.py ...
Compiling ../doc/reference/assoc-agrawal.py ...
Compiling ../doc/reference/assoc-rule.py ...
Compiling ../doc/reference/assoc.py ...
Compiling ../doc/reference/basicattrstat.py ...
Compiling ../doc/reference/basket.py ...
Compiling ../doc/reference/c45.py ...
Compiling ../doc/reference/cb-classifier.py ...
Compiling ../doc/reference/cb-descender.py ...
Compiling ../doc/reference/cb-filter.py ...
Compiling ../doc/reference/cb-learner.py ...
Compiling ../doc/reference/cb-measureattribute.py ...
Compiling ../doc/reference/cb-mydomain.py ...
Compiling ../doc/reference/cb-splitconstructor.py ...
Compiling ../doc/reference/cb-stopcriteria.py ...
Compiling ../doc/reference/classifierFromVar.py ...
Compiling ../doc/reference/contingency1.py ...
Compiling ../doc/reference/contingency2.py ...
Compiling ../doc/reference/contingency3.py ...
Compiling ../doc/reference/contingency4.py ...
Compiling ../doc/reference/contingency5.py ...
Compiling ../doc/reference/contingency6.py ...
Compiling ../doc/reference/contingency7.py ...
Compiling ../doc/reference/contingency8.py ...
Compiling ../doc/reference/discretization.py ...
Compiling ../doc/reference/distributions.py ...
Compiling ../doc/reference/domain1.py ...
Compiling ../doc/reference/domain2.py ...
Compiling ../doc/reference/domainDepot.py ...
Compiling ../doc/reference/example.py ...
Compiling ../doc/reference/example2.py ...
Compiling ../doc/reference/example3.py ...
Compiling ../doc/reference/example_merge.py ...
Compiling ../doc/reference/examplesdistance-missing.py ...
Compiling ../doc/reference/examplesdistance.py ...
Compiling ../doc/reference/exampletable1.py ...
Compiling ../doc/reference/exampletable2.py ...
Compiling ../doc/reference/exampletable3.py ...
Compiling ../doc/reference/exampletable4.py ...
Compiling ../doc/reference/exampletable5.py ...
Compiling ../doc/reference/exampletable_merge.py ...
Compiling ../doc/reference/filter.py ...
Compiling ../doc/reference/filters.py ...
Compiling ../doc/reference/filterv.py ...
Compiling ../doc/reference/findnearest.py ...
Compiling ../doc/reference/graph.py ...
Compiling ../doc/reference/hclust.py ...
Compiling ../doc/reference/hclust_art.py ...
Compiling ../doc/reference/imputation.py ...
Compiling ../doc/reference/knnlearner.py ...
Compiling ../doc/reference/majority.py ...
Compiling ../doc/reference/output.py ...
Compiling ../doc/reference/pp-attributes.py ...
Compiling ../doc/reference/pp-censoring.py ...
Compiling ../doc/reference/pp-discretization.py ...
Compiling ../doc/reference/pp-duplicates.py ...
Compiling ../doc/reference/pp-missing.py ...
Compiling ../doc/reference/pp-noise.py ...
Compiling ../doc/reference/pp-select.py ...
Compiling ../doc/reference/pp-weights.py ...
Compiling ../doc/reference/pythonvariable1.py ...
Compiling ../doc/reference/pythonvariable2a.py ...
Compiling ../doc/reference/pythonvariable2b.py ...
Compiling ../doc/reference/pythonvariable2c.py ...
Compiling ../doc/reference/pythonvariable2d.py ...
Compiling ../doc/reference/randomindices2.py ...
Compiling ../doc/reference/randomindicescv.py ...
Compiling ../doc/reference/randomindicesn.py ...
Compiling ../doc/reference/subsetsgenerators.py ...
Compiling ../doc/reference/symmatrix.py ...
Compiling ../doc/reference/transformvalue-d2c.py ...
Compiling ../doc/reference/transformvalue-domain.py ...
Compiling ../doc/reference/transformvalue-miv.py ...
Compiling ../doc/reference/transformvalue-nc.py ...
Compiling ../doc/reference/transformvalue-o2c.py ...
Compiling ../doc/reference/treelearner.py ...
Compiling ../doc/reference/treestructure.py ...
Compiling ../doc/reference/undefineds.py ...
Compiling ../doc/reference/unusedValues.py ...
Compiling ../doc/reference/values.py ...
Compiling ../doc/reference/variable.py ...
Compiling ../doc/reference/variable2.py ...
Listing ../doc/widgets ...
Compiling ../doc/widgets/OWDataSamplerA.py ...
Sorry: IndentationError: ('unindent does not match any outer indentation level', ('../doc/widgets/OWDataSamplerA.py', 24, 29, '    def data(self, dataset):\n'))
Compiling ../doc/widgets/OWDataSamplerB.py ...
Compiling ../doc/widgets/OWDataSamplerC.py ...
Compiling ../doc/widgets/OWLearningCurveA.py ...
Compiling ../doc/widgets/OWLearningCurveB.py ...
Compiling ../doc/widgets/OWLearningCurveC.py ...
Compiling ../doc/widgets/gui_check.py ...
Compiling ../doc/widgets/gui_checkspin.py ...
Compiling ../doc/widgets/gui_lineedit.py ...
Compiling ../doc/widgets/gui_spin.py ...
Compiling ../mathutil.py ...
Compiling ../orng2Array.py ...
Compiling ../orngAssoc.py ...
Compiling ../orngBayes.py ...
Compiling ../orngC45.py ...
Compiling ../orngCI.py ...
Compiling ../orngCN2.py ...
Compiling ../orngCRS.py ...
Compiling ../orngCluster.py ...
Compiling ../orngContingency.py ...
Compiling ../orngDendrogram.py ...
Compiling ../orngDimRed.py ...
Compiling ../orngDisc.py ...
Compiling ../orngEnsemble.py ...
Compiling ../orngEval.py ...
Compiling ../orngEvalAttr.py ...
Compiling ../orngFS.py ...
Compiling ../orngFSS.py ...
Compiling ../orngIO.py ...
Compiling ../orngImpute.py ...
Compiling ../orngInteract.py ...
Compiling ../orngLR.py ...
Compiling ../orngLR_Jakulin.py ...
Compiling ../orngLWR.py ...
Compiling ../orngLinVis.py ...
Compiling ../orngLookup.py ...
Compiling ../orngMDS.py ...
Compiling ../orngMisc.py ...
Compiling ../orngMultiClass.py ...
Compiling ../orngSVM.py ...
Compiling ../orngStat.py ...
Compiling ../orngTest.py ...
Compiling ../orngTree.py ...
Compiling ../orngWrap.py ...
Listing ../source ...
Listing ../source/corn ...
Listing ../source/corn/obj ...
Listing ../source/include ...
Listing ../source/include/obj ...
Listing ../source/orange ...
Listing ../source/orange/obj ...
Listing ../source/orange/ppp ...
Listing ../source/orange/px ...
Listing ../source/orangene ...
Listing ../source/orangene/obj ...
Listing ../source/orangene/ppp ...
Listing ../source/orangene/px ...
Listing ../source/orangeom ...
Listing ../source/orangeom/obj ...
Listing ../source/orangeom/px ...
Listing ../source/orangeom/wml ...
Listing ../source/pyxtract ...
Compiling ../source/pyxtract/defvectors.py ...
Compiling ../source/pyxtract/jitlink_build.py ...
Compiling ../source/pyxtract/makedep.py ...
Compiling ../source/pyxtract/pyprops.py ...
Compiling ../source/pyxtract/pyxtract.py ...
Listing ../source/statc ...
Listing ../source/statc/obj ...
Compiling ../updateOrange.py ...
Creating directory /OrangeCanvas
/bin/sh: line 1: /OrangeCanvas: No such file or directory
Creating subdirectory /OrangeCanvas/.
/bin/sh: line 1: /OrangeCanvas/.: No such file or directory
Creating subdirectory /OrangeCanvas/./icons
/bin/sh: line 1: /OrangeCanvas/./icons: No such file or directory
/bin/sh: line 1: ./orngSignalManager.pyc: Permission denied
/bin/sh: line 1: ./orngOutput.pyc: Permission denied
/bin/sh: line 1: ./xmlParse.pyc: Permission denied
/bin/sh: line 1: ./orngTabs.pyc: Permission denied
/bin/sh: line 1: ./orngDlgs.pyc: Permission denied
/bin/sh: line 1: ./orngDoc.pyc: Permission denied
/bin/sh: line 1: ./orngResources.pyc: Permission denied
/bin/sh: line 1: ./orngView.pyc: Permission denied
/bin/sh: line 1: ./orngCanvasItems.pyc: Permission denied
Creating directory /OrangeWidgets
/bin/sh: line 1: /OrangeWidgets: No such file or directory
Creating subdirectory /OrangeWidgets/.
/bin/sh: line 1: /OrangeWidgets/.: No such file or directory
Creating subdirectory /OrangeWidgets/./Data
/bin/sh: line 1: /OrangeWidgets/./Data: No such file or directory
Creating subdirectory /OrangeWidgets/./Associate
/bin/sh: line 1: /OrangeWidgets/./Associate: No such file or directory
Creating subdirectory /OrangeWidgets/./Visualize
/bin/sh: line 1: /OrangeWidgets/./Visualize: No such file or directory
Creating subdirectory /OrangeWidgets/./Other
/bin/sh: line 1: /OrangeWidgets/./Other: No such file or directory
Creating subdirectory /OrangeWidgets/./icons
/bin/sh: line 1: /OrangeWidgets/./icons: No such file or directory
Creating subdirectory /OrangeWidgets/./Evaluate
/bin/sh: line 1: /OrangeWidgets/./Evaluate: No such file or directory
Creating subdirectory /OrangeWidgets/./Classify
/bin/sh: line 1: /OrangeWidgets/./Classify: No such file or directory
/bin/sh: line 1: ./Data/OWRank.pyc: Permission denied
/bin/sh: line 1: ./Data/OWDataTable.pyc: Permission denied
/bin/sh: line 1: ./Data/OWDataDomain.pyc: Permission denied
/bin/sh: line 1: ./Data/OWCategorize.pyc: Permission denied
/bin/sh: line 1: ./Data/OWOutcome.pyc: Permission denied
/bin/sh: line 1: ./Data/OWSave.pyc: Permission denied
/bin/sh: line 1: ./Data/OWFile.pyc: Permission denied
/bin/sh: line 1: ./Data/OWSelectData.pyc: Permission denied
/bin/sh: line 1: ./Associate/OWAssociationRulesViewer.pyc: Permission denied
/bin/sh: line 1: ./Associate/OWAssociationRulesPrint.pyc: Permission denied
/bin/sh: line 1: ./Associate/OWInteractionGraph.pyc: Permission denied
/bin/sh: line 1: ./Associate/OWDistanceMap.pyc: Permission denied
/bin/sh: line 1: ./Associate/OWAttributeDistance.pyc: Permission denied
/bin/sh: line 1: ./Associate/OWAssociationRulesFilter.pyc: Permission denied
/bin/sh: line 1: ./Associate/OWAssociationRules.pyc: Permission denied
/bin/sh: line 1: ./Associate/OWExampleDistance.pyc: Permission denied
/bin/sh: line 1: ./Associate/OWKMeans.pyc: Permission denied
/bin/sh: line 1: ./OWAbout.pyc: Permission denied
/bin/sh: line 1: ./Visualize/OWParallelCoordinates.pyc: Permission denied
/bin/sh: line 1: ./Visualize/OWScatterPlot.pyc: Permission denied
/bin/sh: line 1: ./Visualize/OWSieveMultigram.pyc: Permission denied
/bin/sh: line 1: ./Visualize/OWAttributeStatistics.pyc: Permission denied
/bin/sh: line 1: ./Visualize/OWSieveDiagram.pyc: Permission denied
/bin/sh: line 1: ./Visualize/OWPolyviz.pyc: Permission denied
/bin/sh: line 1: ./Visualize/OWMosaicDisplay.pyc: Permission denied
/bin/sh: line 1: ./Visualize/OWSurveyPlot.pyc: Permission denied
/bin/sh: line 1: ./Visualize/OWDistributions.pyc: Permission denied
/bin/sh: line 1: ./Visualize/OWParallelGraph.pyc: Permission denied
/bin/sh: line 1: ./Visualize/OWDistributionsMatrix.pyc: Permission denied
/bin/sh: line 1: ./Visualize/OWScatterPlotGraph.pyc: Permission denied
/bin/sh: line 1: ./Visualize/OWSieveMultigramGraph.pyc: Permission denied
/bin/sh: line 1: ./Visualize/OWRadviz.pyc: Permission denied
/bin/sh: line 1: ./Visualize/OWSurveyPlotGraph.pyc: Permission denied
/bin/sh: line 1: ./Visualize/OWScatterPlotMatrix.pyc: Permission denied
/bin/sh: line 1: ./Visualize/OWRadvizGraph.pyc: Permission denied
/bin/sh: line 1: ./Visualize/OWPolyvizGraph.pyc: Permission denied
/bin/sh: line 1: ./Other/OWInfo.pyc: Permission denied
/bin/sh: line 1: ./Other/OWContinuize.pyc: Permission denied
/bin/sh: line 1: ./OWOptions.pyc: Permission denied
/bin/sh: line 1: ./OWDlgs.pyc: Permission denied
/bin/sh: line 1: ./Evaluate/OWLiftCurve.pyc: Permission denied
/bin/sh: line 1: ./Evaluate/OWCalibrationPlot.pyc: Permission denied
/bin/sh: line 1: ./Evaluate/OWClassifiedDataTable.pyc: Permission denied
/bin/sh: line 1: ./Evaluate/OWTestLearners.pyc: Permission denied
/bin/sh: line 1: ./Evaluate/OWROC.pyc: Permission denied
/bin/sh: line 1: ./OWkNNOptimization.pyc: Permission denied
/bin/sh: line 1: ./OWGUI.pyc: Permission denied
/bin/sh: line 1: ./OWWidget.pyc: Permission denied
/bin/sh: line 1: ./orngTreeLearner.pyc: Permission denied
/bin/sh: line 1: ./OWBaseWidget.pyc: Permission denied
/bin/sh: line 1: ./OWIRankOptions.pyc: Permission denied
/bin/sh: line 1: ./OWEnsemble.pyc: Permission denied
/bin/sh: line 1: ./OWVisTools.pyc: Permission denied
/bin/sh: line 1: ./Classify/OWNaiveBayes.pyc: Permission denied
/bin/sh: line 1: ./Classify/OWLogisticRegression.pyc: Permission denied
/bin/sh: line 1: ./Classify/OWClassificationTree.pyc: Permission denied
/bin/sh: line 1: ./Classify/OWClassificationTreeViewer.pyc: Permission denied
/bin/sh: line 1: ./Classify/OWBasicSVM.pyc: Permission denied
/bin/sh: line 1: ./Classify/OWMajority.pyc: Permission denied
/bin/sh: line 1: ./Classify/OWClassificationTreeViewer2D.pyc: Permission denied
/bin/sh: line 1: ./Classify/OWC45Tree.pyc: Permission denied
/bin/sh: line 1: ./Classify/OWClassificationTreeViewer2DOptions.pyc: Permission denied
/bin/sh: line 1: ./Classify/OWNomogramGraph.pyc: Permission denied
/bin/sh: line 1: ./Classify/OWKNN.pyc: Permission denied
/bin/sh: line 1: ./Classify/OWNaiveBayesSave.pyc: Permission denied
/bin/sh: line 1: ./Classify/OWNomogram.pyc: Permission denied
/bin/sh: line 1: ./OWTools.pyc: Permission denied
/bin/sh: line 1: ./OWVisAttrSelection.pyc: Permission denied
/bin/sh: line 1: ./OWClusterOptimization.pyc: Permission denied
/bin/sh: line 1: ./ColorPalette.pyc: Permission denied
/bin/sh: line 1: ./OWToolbars.pyc: Permission denied
/bin/sh: line 1: ./OWVisFuncts.pyc: Permission denied
/bin/sh: line 1: ./OWGraphTools.pyc: Permission denied
/bin/sh: line 1: ./OWVisGraph.pyc: Permission denied
/bin/sh: line 1: ./OWGraph.pyc: Permission denied
Creating directory /GUIApplications
/bin/sh: line 1: /GUIApplications: No such file or directory
/bin/sh: line 1: cd: ../GUIApplications: No such file or directory
Creating subdirectory /GUIApplications/.
/bin/sh: line 1: /GUIApplications/.: No such file or directory
Creating subdirectory /GUIApplications/./Data
/bin/sh: line 1: /GUIApplications/./Data: No such file or directory
Creating subdirectory /GUIApplications/./Associate
/bin/sh: line 1: /GUIApplications/./Associate: No such file or directory
Creating subdirectory /GUIApplications/./Visualize
/bin/sh: line 1: /GUIApplications/./Visualize: No such file or directory
Creating subdirectory /GUIApplications/./Other
/bin/sh: line 1: /GUIApplications/./Other: No such file or directory
Creating subdirectory /GUIApplications/./icons
/bin/sh: line 1: /GUIApplications/./icons: No such file or directory
Creating subdirectory /GUIApplications/./Evaluate
/bin/sh: line 1: /GUIApplications/./Evaluate: No such file or directory
Creating subdirectory /GUIApplications/./Classify
/bin/sh: line 1: /GUIApplications/./Classify: No such file or directory
/bin/sh: line 1: ./Data/OWRank.pyc: Permission denied
/bin/sh: line 1: ./Data/OWDataTable.pyc: Permission denied
/bin/sh: line 1: ./Data/OWDataDomain.pyc: Permission denied
/bin/sh: line 1: ./Data/OWCategorize.pyc: Permission denied
/bin/sh: line 1: ./Data/OWOutcome.pyc: Permission denied
/bin/sh: line 1: ./Data/OWSave.pyc: Permission denied
/bin/sh: line 1: ./Data/OWFile.pyc: Permission denied
/bin/sh: line 1: ./Data/OWSelectData.pyc: Permission denied
/bin/sh: line 1: ./Associate/OWAssociationRulesViewer.pyc: Permission denied
/bin/sh: line 1: ./Associate/OWAssociationRulesPrint.pyc: Permission denied
/bin/sh: line 1: ./Associate/OWInteractionGraph.pyc: Permission denied
/bin/sh: line 1: ./Associate/OWDistanceMap.pyc: Permission denied
/bin/sh: line 1: ./Associate/OWAttributeDistance.pyc: Permission denied
/bin/sh: line 1: ./Associate/OWAssociationRulesFilter.pyc: Permission denied
/bin/sh: line 1: ./Associate/OWAssociationRules.pyc: Permission denied
/bin/sh: line 1: ./Associate/OWExampleDistance.pyc: Permission denied
/bin/sh: line 1: ./Associate/OWKMeans.pyc: Permission denied
/bin/sh: line 1: ./OWAbout.pyc: Permission denied
/bin/sh: line 1: ./Visualize/OWParallelCoordinates.pyc: Permission denied
/bin/sh: line 1: ./Visualize/OWScatterPlot.pyc: Permission denied
/bin/sh: line 1: ./Visualize/OWSieveMultigram.pyc: Permission denied
/bin/sh: line 1: ./Visualize/OWAttributeStatistics.pyc: Permission denied
/bin/sh: line 1: ./Visualize/OWSieveDiagram.pyc: Permission denied
/bin/sh: line 1: ./Visualize/OWPolyviz.pyc: Permission denied
/bin/sh: line 1: ./Visualize/OWMosaicDisplay.pyc: Permission denied
/bin/sh: line 1: ./Visualize/OWSurveyPlot.pyc: Permission denied
/bin/sh: line 1: ./Visualize/OWDistributions.pyc: Permission denied
/bin/sh: line 1: ./Visualize/OWParallelGraph.pyc: Permission denied
/bin/sh: line 1: ./Visualize/OWDistributionsMatrix.pyc: Permission denied
/bin/sh: line 1: ./Visualize/OWScatterPlotGraph.pyc: Permission denied
/bin/sh: line 1: ./Visualize/OWSieveMultigramGraph.pyc: Permission denied
/bin/sh: line 1: ./Visualize/OWRadviz.pyc: Permission denied
/bin/sh: line 1: ./Visualize/OWSurveyPlotGraph.pyc: Permission denied
/bin/sh: line 1: ./Visualize/OWScatterPlotMatrix.pyc: Permission denied
/bin/sh: line 1: ./Visualize/OWRadvizGraph.pyc: Permission denied
/bin/sh: line 1: ./Visualize/OWPolyvizGraph.pyc: Permission denied
/bin/sh: line 1: ./Other/OWInfo.pyc: Permission denied
/bin/sh: line 1: ./Other/OWContinuize.pyc: Permission denied
/bin/sh: line 1: ./OWOptions.pyc: Permission denied
/bin/sh: line 1: ./OWDlgs.pyc: Permission denied
/bin/sh: line 1: ./Evaluate/OWLiftCurve.pyc: Permission denied
/bin/sh: line 1: ./Evaluate/OWCalibrationPlot.pyc: Permission denied
/bin/sh: line 1: ./Evaluate/OWClassifiedDataTable.pyc: Permission denied
/bin/sh: line 1: ./Evaluate/OWTestLearners.pyc: Permission denied
/bin/sh: line 1: ./Evaluate/OWROC.pyc: Permission denied
/bin/sh: line 1: ./OWkNNOptimization.pyc: Permission denied
/bin/sh: line 1: ./OWGUI.pyc: Permission denied
/bin/sh: line 1: ./OWWidget.pyc: Permission denied
/bin/sh: line 1: ./orngTreeLearner.pyc: Permission denied
/bin/sh: line 1: ./OWBaseWidget.pyc: Permission denied
/bin/sh: line 1: ./OWIRankOptions.pyc: Permission denied
/bin/sh: line 1: ./OWEnsemble.pyc: Permission denied
/bin/sh: line 1: ./OWVisTools.pyc: Permission denied
/bin/sh: line 1: ./Classify/OWNaiveBayes.pyc: Permission denied
/bin/sh: line 1: ./Classify/OWLogisticRegression.pyc: Permission denied
/bin/sh: line 1: ./Classify/OWClassificationTree.pyc: Permission denied
/bin/sh: line 1: ./Classify/OWClassificationTreeViewer.pyc: Permission denied
/bin/sh: line 1: ./Classify/OWBasicSVM.pyc: Permission denied
/bin/sh: line 1: ./Classify/OWMajority.pyc: Permission denied
/bin/sh: line 1: ./Classify/OWClassificationTreeViewer2D.pyc: Permission denied
/bin/sh: line 1: ./Classify/OWC45Tree.pyc: Permission denied
/bin/sh: line 1: ./Classify/OWClassificationTreeViewer2DOptions.pyc: Permission denied
/bin/sh: line 1: ./Classify/OWNomogramGraph.pyc: Permission denied
/bin/sh: line 1: ./Classify/OWKNN.pyc: Permission denied
/bin/sh: line 1: ./Classify/OWNaiveBayesSave.pyc: Permission denied
/bin/sh: line 1: ./Classify/OWNomogram.pyc: Permission denied
/bin/sh: line 1: ./OWTools.pyc: Permission denied
/bin/sh: line 1: ./OWVisAttrSelection.pyc: Permission denied
/bin/sh: line 1: ./OWClusterOptimization.pyc: Permission denied
/bin/sh: line 1: ./ColorPalette.pyc: Permission denied
/bin/sh: line 1: ./OWToolbars.pyc: Permission denied
/bin/sh: line 1: ./OWVisFuncts.pyc: Permission denied
/bin/sh: line 1: ./OWGraphTools.pyc: Permission denied
/bin/sh: line 1: ./OWVisGraph.pyc: Permission denied
/bin/sh: line 1: ./OWGraph.pyc: Permission denied
make: *** [bininstall] Error 126
bash-2.05b#     

Postby jurem » Fri Apr 29, 2005 9:38

Hello,
I'm sure that password is correct. I've tried many times from external IP (so this should not be the problem) and was accepted without any problems. Maybe you have caps lock on or you've typed in 'CVS' not 'cvs' (passwords are always case sensitive).

Installation was never fully imlemented in makefiles, because we are implementing installation with Python Distutils. It is finished and is in testing phase, it will be officialy added (and documented) sometime next week.

If you would like to help testing it, you can download it from:

cvs -d :pserver:cvs@estelle.fri.uni-lj.si:/CVS co install-scripts/linux/setup.py
(of course you should be able to login to CVS)

In setup.py you should manually edit line 43 (variable OrangeVer) to version 0.99, line 43 should look like:
OrangeVer="0.99"

You should put setup.py into orange directory (not source directory) and type (as root):
python setup.py install

This will install all neccessary orange files into Python 'site-packages' directory and take care of everything. After that orange modul should be accessable without any problems.

Please, don't hasitate to ask if you will have any problems.

Regards, Jure

Postby Guest » Fri Apr 29, 2005 10:32

Hi Jure,

Cool, I'll give the distutils a whirl and let you know. I'm sure the password was entered as 'cvs'. Infact it is shown that way in the code snippet I posted above. No big deal here, I'll work on the distutils and get back to you with a report.

Thank you,
Pete

Postby Guest » Fri Apr 29, 2005 11:07

Jure, Idon't understand it, I tried multiple ways (and versions like >cvs<>'cvs'<>"cvs"<>CVS<>anonymous<).

It's not accepting a password
Code: Select all
bash-2.05b# cvs -d :pserver:cvs@estelle.fri.uni-lj.si:/CVS login
Logging in to :pserver:cvs@estelle.fri.uni-lj.si:2401/CVS
CVS password:
cvs [login aborted]: connect to estelle.fri.uni-lj.si(193.2.76.85):2401 failed: Connection refused

bash-2.05b# export CVSROOT=:pserver:cvs@estelle.fri.uni-lj.si:/CVS
bash-2.05b# cvs login
Logging in to :pserver:cvs@estelle.fri.uni-lj.si:2401/CVS
CVS password:
cvs [login aborted]: connect to estelle.fri.uni-lj.si(193.2.76.85):2401 failed: Connection refused
bash-2.05b#

Postby Guest » Fri Apr 29, 2005 11:18

I'm just thinking.. that I'm using 'Shorewall' firewall. It's configured to allow any connection that I initiate, but maybe with cvs, it causes a block for some reason. I don't know; just taking a n00b shot in the dark, here. I'll see if I can mess with the configuration, and try again, but I really can't see how that would be the problem though.

Pete

Postby jurem » Fri Apr 29, 2005 12:02

That is strange indeed.
I am pretty sure that straight 'cvs' (without ') is valid password. It might be, that your firewall is somehow blocking the connection. I don't know your firewall, but try to open all ports (at least for a minute, to use CVS).

Otherwise I can sent you setup.py script via e-mail.

Regards, Jure

Postby Guest » Fri Apr 29, 2005 14:45

Jure I'm very happy to report a successful install and import. :D

A couple of things though:

I had to move these files over from the snapshot I dloaded yesterday; evidently they are not available with the files I dloaded just now.

orange.so
orangene.so
orangeom.so
static.so
corn.so

The only other thing is the source file you listed above:

Code: Select all
cvs -d :pserver:cvs@estelle.fri.uni-lj.si:/CVS co orange/source source


was not there to dload. But..

Code: Select all
cvs -d :pserver:cvs@estelle.fri.uni-lj.si:/CVS co source


worked; which is probably why I had to move those five files over.

Anyway, I thank you very much, and I'm very happy now that my linux box is complete.

Sincerely,
Peter
[/code]

Postby jurem » Mon May 02, 2005 8:45

Hi,
Ićm glad that installation worked.
The problem with checkout source from CVS was my typo here on forum.
Command for source checkout should be:

cvs -d :pserver:cvs@estelle.fri.uni-lj.si:/CVS co -d orange/source source

(note the second -d switch in the command, it tells you where files should be checked out)

Thanks for taking the time and best wishes,

Jure


Return to Bugs



cron