Orange Forum • View topic - Not able to Install in RHEL3 or FC3

Not able to Install in RHEL3 or FC3

Report bugs (or imagined bugs).
(Archived/read-only, please use our ticketing system for reporting bugs and their discussion.)
Forum rules
Archived/read-only, please use our ticketing system for reporting bugs and their discussion.

Not able to Install in RHEL3 or FC3

Postby vasundhar » Sat Jul 16, 2005 18:02

[bvasundhar@ws43 source]$ make all
g++ -fPIC -w -DLINUX -O3 -DNO_NUMERIC -DNO_GSL -c orange/assoc.cpp -o obj/assoc.o
orange/assoc.cpp:36: error: too few template-parameter-lists
orange/assoc.cpp:36: error: expected `,' or `;' before '=' token
make: *** [obj/assoc.o] Error 1
[bvasundhar@ws43 source]$
is the errr I am encountering in fc3

Postby jurem » Tue Aug 16, 2005 4:04

Hi,
can you provide versions of GCC and python?

Regards, Jure

Postby tomaz » Thu Oct 27, 2005 11:18

For Linux installation please see download page.


Return to Bugs